{"text_format":"1","workbook":"xlsx","n_sheets":3,"sheets":["Claim Form - Oil"," RCF - RI Premium Details","Sheet1"],"not_rendered":{"charts":0,"images":1,"macros":0,"external_links":0,"defined_names":1,"comments":0,"pivot_tables":0},"unopened":[],"bounds":{"document_bytes":16777216,"sheet_cells":100000,"rows_first":2000,"rows_last":500,"rows_between":2000,"halvings":0,"cell_chars":16384,"cell_head_chars":4096},"cells_cut":0,"cells_raw":0,"read":"whole","date_system":"1900"}

{"sheet":"Claim Form - Oil","index":0,"n_rows":66,"n_cols":12,"rows_kept":66,"cut":false,"hidden":false,"merged":[[55,1,55,8],[63,2,63,4],[30,1,30,7],[31,3,31,6],[49,3,49,7],[54,1,54,8],[32,3,32,6],[33,3,33,6],[35,3,35,8],[62,2,62,4],[62,5,62,8],[61,1,61,8],[56,1,56,8],[57,1,57,8],[58,1,58,8],[59,1,59,8],[65,2,65,7],[64,2,64,4],[63,5,63,8],[64,5,64,8],[1,1,1,8],[2,1,2,8],[8,2,8,8],[10,1,10,8],[4,2,4,8],[3,7,3,8],[5,7,5,8],[6,7,6,8],[7,2,7,8],[3,2,3,5],[6,2,6,5],[5,2,5,5]]}
[]
[null,"Used Oil\nProcessor Return Incentive Claim Form"]
[null,"All Blue Sections Must Be Completed"]
[null,"Processor Name",null,null,null,null,"Claim/Invoice #"]
[null,"Mailing Address"]
[null,"City and Province",null,null,null,null,"Postal Code"]
[null,"Phone ",null,null,null,null,"GST #"]
[null,"Registration #"]
[null,"Collector Name"]
[]
[null,"All Volumes must be reported in Litres (L)"]
[null,"Reference #","Date Received \nat Processor\n(MM-DD-YY)","Zone","Gross\nVolume","Average Water Test %","Adjusted\nVolume","Zone Rate","Amount Claimed by Processor"]
[null,null,null,null,null,null,{"$f":"+E13*(1-F13)","v":0},{"$f":"IF($D13=\"\",\"-\",VLOOKUP($D13,$D$38:$H$48,5,FALSE))","v":"-"},{"$f":"IF(H13=\"-\",\"-\",G13*H13)","v":"-"},null,null,{"$f":"E13*(1-F13)","v":0}]
[null,null,null,null,null,null,{"$f":"+E14*(1-F14)","v":0},"-",{"$f":"IF(H14=\"-\",\"-\",G14*H14)","v":"-"},null,null,{"$f":"E14*(1-F14)","v":0}]
[null,null,null,null,null,null,{"$f":"+E15*(1-F15)","v":0},"-","-",null,null,{"$f":"E15*(1-F15)","v":0}]
[null,null,null,null,null,null,0,"-","-",null,null,{"$f":"E16*(1-F16)","v":0}]
[null,null,null,null,null,null,0,"-","-",null,null,0]
[null,null,null,null,null,null,0,"-","-",null,null,0]
[null,null,null,null,null,null,0,"-","-",null,null,0]
[null,null,null,null,null,null,0,"-","-",null,null,0]
[null,null,null,null,null,null,0,"-","-",null,null,0]
[null,null,null,null,null,null,0,"-","-",null,null,0]
[null,null,null,null,null,null,0,"-","-",null,null,0]
[null,null,null,null,null,null,0,"-","-",null,null,0]
[null,null,null,null,null,null,0,"-","-",null,null,0]
[null,null,null,null,null,null,0,"-","-",null,null,0]
[null,null,null,null,null,null,0,"-","-",null,null,0]
[null,null,null,null,null,null,0,"-","-",null,null,0]
[null,null,null,null,null,null,0,"-","-",null,null,0]
[null,null,null,"Total",{"$f":"IF(SUM(E13:E29)=0,\"-\",SUM(E13:E29))","v":"-"},{"$f":"IF(E30=\"-\",\"-\",1-(L30/E30))","v":"-"},{"$f":"IF(SUM(G13:G29)=0,\"-\",SUM(G13:G29))","v":"-"},null,{"$f":"SUM(I13:I29)","v":0},null,null,{"$f":"SUM(L13:L29)","v":0}]
[null,"RCF - RI Premium",null,null,null,null,null,null,{"$f":"+' RCF - RI Premium Details'!J30","v":"-"}]
[null,null,null,null,null,null,null,"Subtotal",{"$f":"SUM(I30:I31)","v":0}]
[null,null,null,null,null,null,null,"5% GST",{"$f":"+I32*0.05","v":0}]
[null,null,null,null,null,null,null,"TOTAL",{"$f":"+I32+I33","v":0}]
[]
[null,null,null,"Summary"]
[null,null,null,{"$f":"D12","v":"Zone"},"Gross\nVolume","Average Water Test %","Adjusted\nVolume","Zone Rate","Amount Claimed by Processor"]
[null,null,null,1,{"$f":"SUMIF($D$13:$D$29,$D38,E$13:E$29)","v":0},{"$f":"IF(E38=0,\"-\",1-(L38/E38))","v":"-"},{"$f":"SUMIF($D$13:$D$29,$D38,G$13:G$29)","v":0},8.2000000000000003E-2,{"$f":"SUMIF($D$13:$D$29,$D38,I$13:I$29)","v":0},null,null,{"$f":"SUMIF($D$13:$D$29,$D38,L$13:L$29)","v":0}]
[null,null,null,2,0,{"$f":"IF(E39=0,\"-\",1-(L39/E39))","v":"-"},0,0.124,0,null,null,0]
[null,null,null,3,0,{"$f":"IF(E40=0,\"-\",1-(L40/E40))","v":"-"},0,0.14500000000000002,0,null,null,0]
[null,null,null,4,0,"-",0,0.113,0,null,null,0]
[null,null,null,5,0,"-",0,0.19700000000000001,0,null,null,0]
[null,null,null,6,0,"-",0,0.16400000000000001,0,null,null,0]
[null,null,null,7,0,"-",0,0.114,0,null,null,0]
[null,null,null,8,0,"-",0,0.14500000000000002,0,null,null,0]
[null,null,null,9,0,"-",0,0.14500000000000002,0,null,null,0]
[null,null,null,10,0,"-",0,0.19700000000000001,0,null,null,0]
[null,null,null,11,0,"-",0,0.30300000000000005,0,null,null,0]
[null,null,null,"Total",{"$f":"SUM(E38:E48)","v":0},{"$f":"IF(E49=0,\"-\",1-(L49/E49))","v":"-"},{"$f":"SUM(G38:G48)","v":0},null,{"$f":"SUM(I38:I48)","v":0},null,null,{"$f":"SUM(L38:L48)","v":0}]
[null,null,null,"RCF-RI Premium",null,null,null,null,{"$f":"+I31","v":"-"}]
[null,null,null,null,null,null,null,"Subtotal",{"$f":"SUM(I49:I50)","v":0}]
[null,null,null,null,null,null,null,"5% GST",{"$f":"+I51*0.05","v":0}]
[null,null,null,null,null,null,null,"TOTAL",{"$f":"+I51+I52","v":0}]
[]
[null,"Ensure that all Collector Zone Summary Forms Tickets are submitted."]
[null,"I certify that all of the information contained within this claim form is correct."]
[null,"I understand the information in this report is subject to Desk Reviews, Field Reviews, and Compliance Reviews."]
[null,"The detailed records which substantiate the information herein are available upon request."]
[null,"I certify that, to the best of my knowledge, the materials included in this claim form were generated within British Columbia. "]
[null,"I certify that, to the best of my knowledge, only eligible oil materials (as determined by BCUOMA from time to time) have been included in this claim form. "]
[null,"I certify that, to the best of my knowledge, all processed materials have been sold for use in approved end uses (as determined by BCUOMA from time to time)."]
[null,"I further acknowledge that I have read, and agree to be bound by, the terms and conditions in to the Lubricating Oil Material Product Management Program \nManual for Processors and Collectors."]
[null,null,"Full Name and Title",null,null,"Approval and Date"]
[null,"Prepared By"]
[null,"Approved By"]
[null,"BCUOMA1501O-P","BCUOMA GST NO. 89254 4701 RT0001",null,null,null,null,null,"July  1, 2021"]

{"sheet":" RCF - RI Premium Details","index":1,"n_rows":30,"n_cols":15,"rows_kept":30,"cut":false,"hidden":false,"merged":[[1,1,1,9],[2,1,2,9],[3,2,3,9],[4,2,4,9],[5,2,5,6],[6,2,6,9],[7,2,7,9],[9,1,9,9],[8,3,8,9],[5,7,5,9]]}
[]
[null,"Used Oil\nRCF Collection Details",null,null,null,null,null,null,null,null,null,null,null,0.1]
[null,"All Blue Sections Must Be Completed"]
[null,"Processor Name"]
[null,"Mailing Address"]
[null,"City and Province",null,null,null,null,null,"Postal Code: "]
[null,"Phone "]
[null,"Registration #"]
[]
[null,"All Volumes must be reported in Litres (L)"]
[null,"Collector \nName","Collector Zone\nSummary #","RCF Collection \nDocket #","Date of Collection (MM-DD-YY)","RCF Location Name\n(Select from the list)","Gross\nVolume","% of Product \nConsumer Drop Off","Adjusted\nVolume","RI Premium"]
[null,null,null,null,null,null,null,{"$f":"IFERROR(VLOOKUP(F12,Sheet1!$B$3:$D$290,3,FALSE),\"\")","v":""},{"$f":"IF(G12=0,\"-\",G12*H12)","v":"-"},{"$f":"IF(OR(ISBLANK(G12),ISBLANK(H12)), \"\", G12*H12*$N$2)","v":""},{"$f":"J12*(1-#REF!)","v":{"$error":"#VALUE!"}}]
[null,null,null,null,null,null,null,{"$f":"IFERROR(VLOOKUP(F13,Sheet1!$B$3:$D$290,3,FALSE),\"\")","v":""},"-",{"$f":"IF(OR(ISBLANK(G13),ISBLANK(H13)), \"\", G13*H13*$N$2)","v":""},{"$f":"#REF!*(1-#REF!)","v":{"$error":"#REF!"}},null,null,null,{"$f":"IF(OR(ISBLANK(A2),ISBLANK(B2)), \"\", G12*H12)","v":""}]
[null,null,null,null,null,null,null,{"$f":"IFERROR(VLOOKUP(F14,Sheet1!$B$3:$D$290,3,FALSE),\"\")","v":""},"-",""]
[null,null,null,null,null,null,null,{"$f":"IFERROR(VLOOKUP(F15,Sheet1!$B$3:$D$290,3,FALSE),\"\")","v":""},"-","",{"$f":"J15*(1-#REF!)","v":{"$error":"#VALUE!"}}]
[null,null,null,null,null,null,null,{"$f":"IFERROR(VLOOKUP(F16,Sheet1!$B$3:$D$290,3,FALSE),\"\")","v":""},"-","",{"$f":"J16*(1-#REF!)","v":{"$error":"#VALUE!"}}]
[null,null,null,null,null,null,null,{"$f":"IFERROR(VLOOKUP(F17,Sheet1!$B$3:$D$290,3,FALSE),\"\")","v":""},"-","",{"$f":"J17*(1-#REF!)","v":{"$error":"#VALUE!"}}]
[null,null,null,null,null,null,null,{"$f":"IFERROR(VLOOKUP(F18,Sheet1!$B$3:$D$290,3,FALSE),\"\")","v":""},"-","",{"$f":"J18*(1-#REF!)","v":{"$error":"#VALUE!"}}]
[null,null,null,null,null,null,null,{"$f":"IFERROR(VLOOKUP(F19,Sheet1!$B$3:$D$290,3,FALSE),\"\")","v":""},"-","",{"$f":"J19*(1-#REF!)","v":{"$error":"#VALUE!"}}]
[null,null,null,null,null,null,null,{"$f":"IFERROR(VLOOKUP(F20,Sheet1!$B$3:$D$290,3,FALSE),\"\")","v":""},"-","",{"$f":"J20*(1-#REF!)","v":{"$error":"#VALUE!"}}]
[null,null,null,null,null,null,null,{"$f":"IFERROR(VLOOKUP(F21,Sheet1!$B$3:$D$290,3,FALSE),\"\")","v":""},"-","",{"$f":"J21*(1-#REF!)","v":{"$error":"#VALUE!"}}]
[null,null,null,null,null,null,null,{"$f":"IFERROR(VLOOKUP(F22,Sheet1!$B$3:$D$290,3,FALSE),\"\")","v":""},{"$f":"IF(G22=0,\"-\",G22*H22)","v":"-"},"",{"$f":"J22*(1-#REF!)","v":{"$error":"#VALUE!"}}]
[null,null,null,null,null,null,null,{"$f":"IFERROR(VLOOKUP(F23,Sheet1!$B$3:$D$290,3,FALSE),\"\")","v":""},{"$f":"IF(G23=0,\"-\",G23*H23)","v":"-"},"",{"$f":"J23*(1-#REF!)","v":{"$error":"#VALUE!"}}]
[null,null,null,null,null,null,null,{"$f":"IFERROR(VLOOKUP(F24,Sheet1!$B$3:$D$290,3,FALSE),\"\")","v":""},"-","",{"$f":"J24*(1-#REF!)","v":{"$error":"#VALUE!"}}]
[null,null,null,null,null,null,null,{"$f":"IFERROR(VLOOKUP(F25,Sheet1!$B$3:$D$290,3,FALSE),\"\")","v":""},"-","",{"$f":"J25*(1-#REF!)","v":{"$error":"#VALUE!"}}]
[null,null,null,null,null,null,null,{"$f":"IFERROR(VLOOKUP(F26,Sheet1!$B$3:$D$290,3,FALSE),\"\")","v":""},"-","",{"$f":"J26*(1-#REF!)","v":{"$error":"#VALUE!"}}]
[null,null,null,null,null,null,null,{"$f":"IFERROR(VLOOKUP(F27,Sheet1!$B$3:$D$290,3,FALSE),\"\")","v":""},"-","",{"$f":"J27*(1-#REF!)","v":{"$error":"#VALUE!"}}]
[null,null,null,null,null,null,null,{"$f":"IFERROR(VLOOKUP(F28,Sheet1!$B$3:$D$290,3,FALSE),\"\")","v":""},"-","",{"$f":"J28*(1-#REF!)","v":{"$error":"#VALUE!"}}]
[null,null,null,null,null,null,null,{"$f":"IFERROR(VLOOKUP(F29,Sheet1!$B$3:$D$290,3,FALSE),\"\")","v":""},"-","",{"$f":"J29*(1-#REF!)","v":{"$error":"#VALUE!"}}]
[null,null,null,null,null,null,{"$f":"SUM(G12:G29)","v":0},null,{"$f":"SUM(I12:I29)","v":0},{"$f":"IF(SUM(J12:J29)=0,\"-\",SUM(J12:J29))","v":"-"},{"$f":"SUM(K12:K29)","v":{"$error":"#VALUE!"}}]

{"sheet":"Sheet1","index":2,"n_rows":290,"n_cols":11,"rows_kept":290,"cut":false,"hidden":false,"merged":[]}
[]
[null,"Business Name","Type","Rate"]
[null,"150 M & S Tire & Service Ltd.","Auto Repair/Car Dealer",{"$f":"VLOOKUP(C3,$J$7:$K$14,2,FALSE)","v":0.5}]
[null,"7 Mile Landfill and Recycling Center (RDMW)","Recycling Center",1]
[null,"70 Mile House Eco-Depot (TNRD)","Recycling Center",1]
[null,"Ace Automotive","Auto Repair/Car Dealer",0.5]
[null,"Alberni Chrysler Ltd.","Auto Repair/Car Dealer",0.5,null,null,null,null,null,"Type","Rate"]
[null,"Alberni District Co-operative Association","Retailer",0.75,null,null,null,null,null,"Recycling Center",1]
[null,"Alberni Valley Landfill (ACRD)","Landfill/Transfer Station",1,null,null,null,null,null,"Bulk Dealer",1]
[null,"Aldergrove Return-It Depot","Recycling Center",1,null,null,null,null,null,"Landfill/Transfer Station",1]
[null,"Arjun Esso","Auto Repair/Car Dealer",0.5,null,null,null,null,null,"Multi-material Depot",1]
[null,"A-Star Automotive Recycling Ltd.","Auto Repair/Car Dealer",0.5,null,null,null,null,null,"Retailer",0.75]
[null,"Beddis Road Garage","Auto Repair/Car Dealer",0.5,null,null,null,null,null,"Auto Repair/Car Dealer",0.5]
[null,"Bings Creek Recycling Centre (CWRD)","Recycling Center",1,null,null,null,null,null,"Lube Shop",0.2]
[null,"Blue River Eco-Depot (TNRD)","Recycling Center",1]
[null,"Bowen Island Municipality Recycling Depot","Recycling Center",1]
[null,"Bowser Automotive Care","Auto Repair/Car Dealer",0.5]
[null,"Brentwood Auto & Metal Recyclers","Auto Repair/Car Dealer",0.5]
[null,"Bridgeview Marine Ltd.","Retailer",0.75]
[null,"Burns Lake Automotive Supply Ltd. (Burns Lake)","Retailer",0.75]
[null,"C M Klassen Holdings Inc.","Bulk Dealer",1]
[null,"Campbell Mountain Landfill (RDOS)","Landfill/Transfer Station",1]
[null,"Campbell River Waste Management Centre (CXRD)","Multi-material Depot",1]
[null,"Canadian Tire #360 (Prince George)","Retailer",0.75]
[null,"Canadian Tire #363  (Fort St. John)","Retailer",0.75]
[null,"Canadian Tire #438  (Williams Lake - Mar 2018)","Retailer",0.75]
[null,"Canadian Tire #466  (Duncan)","Retailer",0.75]
[null,"Canadian Tire #488  (Port Alberni)","Retailer",0.75]
[null,"Canadian Tire 631 (Smithers)","Retailer",0.75]
[null,"Caron Horsefly Service Ltd (Race Trac Gas)","Auto Repair/Car Dealer",0.5]
[null,"Castle Fuels (2008) Inc. (100 Mile House)","Bulk Dealer",1]
[null,"Castle Fuels (2008) Inc. (Cranbrook)","Bulk Dealer",1]
[null,"Castle Fuels (2008) Inc. (Golden)","Bulk Dealer",1]
[null,"Castle Fuels (2008) Inc. (Invermere)","Bulk Dealer",1]
[null,"Castle Fuels (2008) Inc. (Kamloops)","Bulk Dealer",1]
[null,"Castle Fuels (2008) Inc. (Salmon Arm)","Bulk Dealer",1]
[null,"Chapman Motors Ltd.","Auto Repair/Car Dealer",0.5]
[null,"Chap's Auto Body","Auto Repair/Car Dealer",0.5]
[null,"Chetwynd Recycling & Bottle Depot Ltd.","Recycling Center",1]
[null,"Chilliwack Bottle Depot","Multi-material Depot",1]
[null,"Chilliwack Ford Sales (1981) Ltd.","Auto Repair/Car Dealer",0.5]
[null,"Christina Lake Mechanical Ltd.","Auto Repair/Car Dealer",0.5]
[null,"Chuck's Auto Supply","Retailer",0.75]
[null,"City of Burnaby Eco-Center","Recycling Center",1]
[null,"Clair Downey Service","Auto Repair/Car Dealer",0.5]
[null,"Clearwater Eco-Depot (TNRD)","Recycling Center",1]
[null,"Clinton Eco-Depot (TNRD)","Recycling Center",1]
[null,"Columbia Diesel Ltd.","Bulk Dealer",1]
[null,"Columbia Fuels (Sechelt)","Bulk Dealer",1]
[null,"Columbia Fuels (Ucluelet) / Eagle Marine","Bulk Dealer",1]
[null,"Comfort Welding Ltd.","Auto Repair/Car Dealer",0.5]
[null,"Comox Valley Harbour Authority","Recycling Center",1]
[null,"Comox Valley Waste Management Centre - Cumberland (CXRD)","Multi-material Depot",1]
[null,"Cortes Island Waste Management Center (CXRD)","Multi-material Depot",1]
[null,"Courtenay Kia","Auto Repair/Car Dealer",0.5]
[null,"Cranbrook Depot (RDEK)","Multi-material Depot",1]
[null,"Crofton Auto Service","Auto Repair/Car Dealer",0.5]
[null,"Cunningham's Enterprise Ltd.","Auto Repair/Car Dealer",0.5]
[null,"D.L. Recycling","Recycling Center",1]
[null,"Dalex Auto Services","Auto Repair/Car Dealer",0.5]
[null,"Dave Landon Motors Ltd.","Auto Repair/Car Dealer",0.5]
[null,"Dawn's Service","Auto Repair/Car Dealer",0.5]
[null,"Day Auto Electric","Auto Repair/Car Dealer",0.5]
[null,"Dearborn Motors Ltd.","Auto Repair/Car Dealer",0.5]
[null,"Denham Ford BC Ltd. (2018)","Auto Repair/Car Dealer",0.5]
[null,"Denman Island Recycling Depot (CXRD)","Recycling Center",1]
[null,"Derick's Automotive Services","Auto Repair/Car Dealer",{"$f":"VLOOKUP(C67,$J$7:$K$14,2,FALSE)","v":0.5}]
[null,"Desert Cardlock Fuel Services Ltd (Kelowna)","Bulk Dealer",1]
[null,"Desert Cardlock Fuel Services Ltd (Williams Lake)","Bulk Dealer",1]
[null,"Discovery Harbour Authority","Recycling Center",1]
[null,"District of Summerland Landfill","Landfill/Transfer Station",1]
[null,"E.J. Klassen GM Motorcade","Auto Repair/Car Dealer",0.5]
[null,"Elkford Transfer Station (RDEK)","Landfill/Transfer Station",1]
[null,"Entire Automotive Services Ltd.","Auto Repair/Car Dealer",0.5]
[null,"Ernie's Used Auto Parts","Auto Repair/Car Dealer",0.5]
[null,"EZ Lube Auto Ltd. (Langford - Jacklin Rd)","Lube Shop",0.2]
[null,"False Creek Fuels","Bulk Dealer",1]
[null,"False Creek Harbour Authority","Recycling Center",1]
[null,"Fisher Road Recycling","Recycling Center",1]
[null,"Fleetwest Enterprises Ltd.","Retailer",0.75]
[null,"Foothills Boulevard Regional Landfill (FFGRD)","Landfill/Transfer Station",1]
[null,"Fort St John Co-op Association (Fort St John - 100 Ave)","Bulk Dealer",1]
[null,"Fort St John Co-op Association (Fort St John - 91 Ave)","Bulk Dealer",1]
[null,"Fort St John Co-op Association (Prespatou)","Bulk Dealer",1]
[null,"Four Rivers Co-op (Houston)","Bulk Dealer",1]
[null,"Four Rivers Co-op (Prince George)","Bulk Dealer",1]
[null,"Four Rivers Co-op (Quesnel)","Bulk Dealer",1]
[null,"Four Rivers Co-op (Terrace Cardlock)","Bulk Dealer",1]
[null,"Four Rivers Co-op (Vanderhoof)","Bulk Dealer",1]
[null,"Frank's Auto Repair","Auto Repair/Car Dealer",0.5]
[null,"Fraser Lake Automotive & Recycling","Auto Repair/Car Dealer",0.5]
[null,"Fraser Lake AutoSense","Retailer",0.75]
[null,"Fraser Valley Tireland","Retailer",0.75]
[null,"Furney Distributing Limited","Bulk Dealer",1]
[null,"G & R Auto","Auto Repair/Car Dealer",0.5]
[null,"Gabriola Island Recycling Organization (GIRO)","Recycling Center",1]
[null,"Gardner Chevrolet Oldsmobile Pontiac Buick","Auto Repair/Car Dealer",0.5]
[null,"Gartside Marine Engines Ltd","Retailer",0.75]
[null,"Gary Young Agencies","Bulk Dealer",1]
[null,"Geraco Industrial Supplies","Retailer",0.75]
[null,"GFL Environmental Depot (Abbotsford)","Multi-material Depot",1]
[null,"GFL Environmental Depot (Chemainus)","Multi-material Depot",1]
[null,"GFL Environmental Depot (Duncan)","Multi-material Depot",1]
[null,"GFL Environmental Depot (Grand Forks)","Recycling Center",1]
[null,"GFL Environmental Depot (Nanaimo)","Multi-material Depot",1]
[null,"GFL Environmental Depot (Victoria)","Multi-material Depot",1]
[null,"GFL Environmental Liquids West","Bulk Dealer",1]
[null,"Glacier Toyota","Auto Repair/Car Dealer",0.5]
[null,"Glenn's Import & Domestic Auto Service","Auto Repair/Car Dealer",0.5]
[null,"Gold Automotive Ltd.","Auto Repair/Car Dealer",0.5]
[null,"Gold Bridge Transfer Station (SLRD)","Landfill/Transfer Station",1]
[null,"Gold River Waste Management Center (CXRD)","Multi-material Depot",1]
[null,"Gold Trail Recycling Ltd","Recycling Center",1]
[null,"Golden Landfill (CSRD)","Landfill/Transfer Station",1]
[null,"Great Canadian Oil Change (Chilliwack - Alexander Ave)","Lube Shop",0.2]
[null,"Great Canadian Oil Change (Chilliwack - Vedder Rd)","Lube Shop",0.2]
[null,"Great Canadian Oil Change (Courtenay)","Lube Shop",0.2]
[null,"Great Canadian Oil Change (Cranbrook)","Lube Shop",0.2]
[null,"Great Canadian Oil Change (Dawson Creek)","Lube Shop",0.2]
[null,"Great Canadian Oil Change (Duncan - June 2016)","Lube Shop",0.2]
[null,"Great Canadian Oil Change (Kelowna - Harvey Ave)","Lube Shop",0.2]
[null,"Great Canadian Oil Change (Kelowna - Richter St)","Lube Shop",0.2]
[null,"Great Canadian Oil Change (Langford - Langford Pkwy)","Lube Shop",0.2]
[null,"Great Canadian Oil Change (Langford - Millstream)","Lube Shop",0.2]
[null,"Great Canadian Oil Change (Nanaimo - Island Hwy)","Lube Shop",0.2]
[null,"Great Canadian Oil Change (Nanaimo - Metral Dr)","Lube Shop",0.2]
[null,"Great Canadian Oil Change (Parksville)","Lube Shop",0.2]
[null,"Great Canadian Oil Change (Penticton)","Lube Shop",0.2]
[null,"Great Canadian Oil Change (Prince George - 15 Avenue)","Lube Shop",0.2]
[null,"Great Canadian Oil Change (Prince George - Austin Rd)","Lube Shop",0.2]
[null,"Great Canadian Oil Change (Squamish)","Lube Shop",{"$f":"VLOOKUP(C131,$J$7:$K$14,2,FALSE)","v":0.2}]
[null,"Great Canadian Oil Change (Surrey - King George Blvd)","Lube Shop",0.2]
[null,"Great Canadian Oil Change (Vernon - 27th Street)","Lube Shop",0.2]
[null,"Great Canadian Oil Change (Vernon - Anderson Way)","Lube Shop",0.2]
[null,"Great Canadian Oil Change (Victoria - Douglas St - Apr 2019)","Lube Shop",0.2]
[null,"Great Canadian Oil Change (West Kelowna)","Lube Shop",0.2]
[null,"Great Canadian Oil Change (Winfield - Lake Country)","Lube Shop",0.2]
[null,"Greendale Motors Ltd","Auto Repair/Car Dealer",0.5]
[null,"Greenwood Auto Centre Ltd.","Auto Repair/Car Dealer",0.5]
[null,"Greenwood Saw To Truck Repairs","Auto Repair/Car Dealer",0.5]
[null,"Gurton's Garage Ltd.","Auto Repair/Car Dealer",0.5]
[null,"Hallmark Ford Sales Ltd.","Auto Repair/Car Dealer",0.5]
[null,"Harris Mazda","Auto Repair/Car Dealer",0.5]
[null,"Hartland Landfill (CRD)","Recycling Center",1]
[null,"Heffley Creek Eco-Depot (TNRD)","Recycling Center",1]
[null,"Heiltsuk Environmental Services","Recycling Center",1]
[null,"Highway 4 Auto Salvage","Retailer",0.75]
[null,"Hilts Automotive","Auto Repair/Car Dealer",0.5]
[null,"Hudson's Hope Transfer Station (PRRD)","Landfill/Transfer Station",1]
[null,"Integra Tire Auto Center","Auto Repair/Car Dealer",0.5]
[null,"Interior Freight & Bottle Depot Ltd.","Recycling Center",1]
[null,"Ironwood Auto Technicians","Auto Repair/Car Dealer",0.5]
[null,"Island Hose & Hydraulic (1994) Ltd.","Retailer",0.75]
[null,"Island Solid Waste Management - Port Clements","Landfill/Transfer Station",1]
[null,"Island Solid Waste Management - Skidegate","Landfill/Transfer Station",1]
[null,"Island Tractor & Supply","Retailer",0.75]
[null,"Jacobson Ford Sales Ltd (Revelstoke)","Auto Repair/Car Dealer",0.5]
[null,"Jacobson Ford Sales Ltd (Salmon Arm)","Auto Repair/Car Dealer",0.5]
[null,"Jepson Petroleum Ltd. (Mackenzie)","Bulk Dealer",1]
[null,"Jepson Petroleum Ltd. (Prince George)","Bulk Dealer",1]
[null,"Jepson Petroleum Ltd. (Quesnel)","Bulk Dealer",1]
[null,"Jepson Petroleum Ltd. (Williams Lake)","Bulk Dealer",1]
[null,"Jiffy Lube #1015 (Penticton)","Lube Shop",0.2]
[null,"Jiffy Lube #1043 (West Kelowna)","Lube Shop",0.2]
[null,"Jiffy Lube #1064 (Kelowna - Sexsmith Rd)","Lube Shop",0.2]
[null,"Jiffy Lube #1075 (Victoria)","Lube Shop",0.2]
[null,"Jiffy Lube #1078  (Salmon Arm)","Lube Shop",0.2]
[null,"Jiffy Lube #1080 (Kelowna - Harvey Ave)","Lube Shop",0.2]
[null,"Jiffy Lube #1088 (Richmond)","Lube Shop",0.2]
[null,"Jiffy Lube #1090 (Chilliwack)","Lube Shop",0.2]
[null,"JNR Auto Services","Auto Repair/Car Dealer",0.5]
[null,"Kal Tire (Kitimat)","Auto Repair/Car Dealer",0.5]
[null,"Kal Tire (Prince Rupert)","Auto Repair/Car Dealer",0.5]
[null,"Kenmac Parts","Retailer",0.75]
[null,"Keremeos Transfer Station (RDOS)","Landfill/Transfer Station",1]
[null,"Kitasoo Band Council","Recycling Center",1]
[null,"Lake City Ford Sales Ltd.","Auto Repair/Car Dealer",0.5]
[null,"Laketime Services","Auto Repair/Car Dealer",0.5]
[null,"Lasqueti Island Recycling Depot (qRD)","Recycling Center",1]
[null,"Likely Landfill (CBRD)","Recycling Center",1]
[null,"Lillooet Landfill (SLRD)","Landfill/Transfer Station",1]
[null,"Lil'wat Nation Public Works Yard","Landfill/Transfer Station",1]
[null,"Local Automotive Co. Ltd.","Auto Repair/Car Dealer",0.5]
[null,"Logan Lake Eco-Depot (TNRD)","Recycling Center",1]
[null,"Louis Creek Eco-Depot (TNRD)","Recycling Center",1]
[null,"Lower Nicola Eco-Depot (TNRD)","Recycling Center",1]
[null,"Lytton Eco-Depot (TNRD)","Recycling Center",1]
[null,"MacCarthy Motors Ltd","Auto Repair/Car Dealer",0.5]
[null,"Mackenzie Regional Landfill (FFGRD)","Landfill/Transfer Station",1]
[null,"McBride Regional Transfer Station (FFGRD)","Landfill/Transfer Station",1]
[null,"Meade Creek Recycling Centre (CWRD)","Recycling Center",1]
[null,"Mertin Pontiac Buick","Auto Repair/Car Dealer",0.5]
[null,"Method Marine Supply Co. Ltd","Retailer",0.75]
[null,"Midas Auto Service (Chilliwack)","Auto Repair/Car Dealer",0.5]
[null,"Mission Recycling Depot","Recycling Center",{"$f":"VLOOKUP(C195,$J$7:$K$14,2,FALSE)","v":1}]
[null,"Mobil 1 Lube Express (Hope)","Lube Shop",0.2]
[null,"Mr. Lube #141 (Burnaby - Hastings)","Lube Shop",0.2]
[null,"Mr. Lube #147 (Kamloops - Summit Lubricants)","Lube Shop",0.2]
[null,"Mr. Lube #159 (Coquitlam)","Lube Shop",0.2]
[null,"Mr. Lube #177 (Courtenay/Comox)","Lube Shop",0.2]
{"$rows_left_out":90}